{"text_format":"1","workbook":"xlsx","n_sheets":4,"sheets":["GM aktas","Suvestine","darbinis","Rekvizitai"],"not_rendered":{"charts":0,"images":1,"macros":1,"external_links":0,"defined_names":33,"comments":1,"pivot_tables":0},"unopened":[],"bounds":{"document_bytes":16777216,"sheet_cells":100000,"rows_first":2000,"rows_last":500,"rows_between":2000,"halvings":0,"cell_chars":16384,"cell_head_chars":4096},"cells_cut":0,"cells_raw":0,"read":"whole","date_system":"1900"}

{"sheet":"GM aktas","index":0,"n_rows":344,"n_cols":15,"rows_kept":344,"cut":false,"hidden":false,"merged":[[339,5,339,6],[342,5,342,6],[18,2,18,4],[20,2,20,4],[22,2,22,4],[1,0,1,7],[12,2,12,4],[14,2,14,4],[16,2,16,4],[2,0,2,7],[6,2,6,4],[3,0,3,7],[8,2,8,4],[10,2,10,4],[15,2,15,4]]}
[null,null,null,null,null,null,"Priedas Nr. 2"]
["GRĮŽTAMŲJŲ MEDŽIAGŲ AKTAS"]
["Rangovui parduodamoms medžiagoms"]
["Akto forma galioja iki 2026.06.30"]
[]
[]
["1.","Rangovas","pasirinkti",null,null,null,{"$f":"IF($C$7=\"pasirinkti\",\"\",\"Rangovas\")","v":""}]
[]
["2.","Rangos darbų sutarties Nr.","Įveskite Sutarties Nr.",null,null,null,{"$f":"IF($C$7=\"pasirinkti\",\"\",VLOOKUP($C$7,Rekvizitai!$A:$E,2,0))","v":""}]
[]
["3.","Rangos darbų užsakymo Nr. (iš TIVIS)","Užpildyti",null,null,null,{"$f":"IF($C$7=\"pasirinkti\",\"\",VLOOKUP($C$7,Rekvizitai!$A:$E,3,0))","v":""}]
[]
["4.","Objekto pavadinimas pagal TIVIS:","Užpildyti",null,null,null,{"$f":"IF($C$7=\"pasirinkti\",\"\",VLOOKUP($C$7,Rekvizitai!$A:$E,4,0))","v":""}]
[]
["5.","Investicinis Nr./Darbų Nr.  (iš TIVIS)","Užpildyti",null,null,null,{"$f":"IF($C$7=\"pasirinkti\",\"\",VLOOKUP($C$7,Rekvizitai!$A:$E,5,0))","v":""}]
["6.","Objekto Nr. (iš TIVIS)","Užpildyti"]
["7.","Grįžtamųjų medžiagų atsiradimo priežastis: ","pasirinkti"]
[]
["8.","GM akto pateikimo data:","202x-xx-xx",null,null,null,"Pardavėjas:"]
[]
["9.","Atliktų darbų akto* pateikimo data:","202x-xx-xx",null,null,null,"AB „Energijos skirstymo operatorius“",null,null,null,null,null,null,null,{"$f":"((IF(C9=\"Įveskite Sutarties Nr.\",1,0))+(IF(C7=\"PASIRINKTI\",1,0))+(IF(C11=\"UŽPILDYTI\",1,0))+(IF(C13=\"UŽPILDYTI\",1,0))+(IF(C15=\"UŽPILDYTI\",1,0))+(IF(C17=\"PASIRINKTI\",1,0))+IF(C19=\"202*-XX-XX\",1,IF(C19>(TODAY()+5),1,0))+(IF(C21=\"202*-XX-XX\",1,0))+(IF(F340=\"\",1,0))+(IF(F343=\"\",1,0)))+(SUM(J30:J219))+O22","v":10}]
[null,null,null,null,null,null,"Laisvės pr. 10, LT-04215 Vilnius ",null,null,null,null,null,null,null,{"$f":"IF(C17=\"6111007 Medžiagų nurašymas\",0,IF(C23=\"užpildyti\",1,IF(C23=\"\",1,0)))","v":1}]
["10.","Objekto Inventorinis Nr.","Užpildyti",null,null,null,"Įmonės kodas 304151376"]
[null,null,null,null,null,null,"PVM kodas LT100009860612"]
["*įkainių taikymo laikotarpis nustatomas pagal Atliktų darbų akto pateikimo Užsakovui datą."]
[]
[]
["Eil. Nr.","Grįžtamosios medžiagos (prekės) pavadinimas","Mato vnt. ","Grįžtamosios medžiagos (prekės) 1 mato vnt. svoris, kg","Faktiškai rastas kiekis mato vienetais.","Suma, Eur be PVM\n","Dynamics kodas","Dynamics kodas",1]
[null,"Metalo konstrukcijos"]
[1,"Traversa T-1","vnt.",0.7,null,{"$f":"(VLOOKUP(G30,Suvestine!B:D,3,0))*(E30*D30)","v":0},22101000540017,22101000540017,{"$f":"IF(E30<>\"\",1,0)","v":0}]
[2,"Traversa T-2","vnt.",1.7,null,{"$f":"(VLOOKUP(G31,Suvestine!B:D,3,0))*(E31*D31)","v":0},22101000540017,22101000540017,{"$f":"IF(E31<>\"\",1,0)","v":0}]
[3,"Traversa I-1","vnt.",1.7,null,{"$f":"(VLOOKUP(G32,Suvestine!B:D,3,0))*(E32*D32)","v":0},22101000540017,22101000540017,0]
[4,"Traversa I-2","vnt.",3.9,null,{"$f":"(VLOOKUP(G33,Suvestine!B:D,3,0))*(E33*D33)","v":0},22101000540017,22101000540017,0]
[5,"Traversa K-1","vnt.",1.5,null,{"$f":"(VLOOKUP(G34,Suvestine!B:D,3,0))*(E34*D34)","v":0},22101000540017,22101000540017,0]
[6,"Traversa K-2","vnt.",3.6,null,{"$f":"(VLOOKUP(G35,Suvestine!B:D,3,0))*(E35*D35)","v":0},22101000540017,22101000540017,0]
[7,"Ramsčio konstrukcija PTM-1,1","vnt.",4.2,null,{"$f":"(VLOOKUP(G36,Suvestine!B:D,3,0))*(E36*D36)","v":0},22101000540017,22101000540017,0]
[8,"Ramsčio konstrukcija PTM-2,7","vnt.",8,null,{"$f":"(VLOOKUP(G37,Suvestine!B:D,3,0))*(E37*D37)","v":0},22101000540017,22101000540017,0]
[9,"Viršūnė T","vnt.",3.5,null,{"$f":"(VLOOKUP(G38,Suvestine!B:D,3,0))*(E38*D38)","v":0},22101000540017,22101000540017,0]
[10,"Traversa T","vnt.",6.6,null,{"$f":"(VLOOKUP(G39,Suvestine!B:D,3,0))*(E39*D39)","v":0},22101000540017,22101000540017,0]
[11,"Viršūnė TA","vnt.",5.5,null,{"$f":"(VLOOKUP(G40,Suvestine!B:D,3,0))*(E40*D40)","v":0},22101000540017,22101000540017,0]
[12,"Traversa TA","vnt.",9,null,{"$f":"(VLOOKUP(G41,Suvestine!B:D,3,0))*(E41*D41)","v":0},22101000540017,22101000540017,0]
[13,"Viršūnė TK-9","vnt.",5.0999999999999996,null,{"$f":"(VLOOKUP(G42,Suvestine!B:D,3,0))*(E42*D42)","v":0},22101000540017,22101000540017,0]
[14,"Traversa TK-9","vnt.",15,null,{"$f":"(VLOOKUP(G43,Suvestine!B:D,3,0))*(E43*D43)","v":0},22101000540017,22101000540017,0]
[15,"Viršūnė TK-9A","vnt.",8.6999999999999993,null,{"$f":"(VLOOKUP(G44,Suvestine!B:D,3,0))*(E44*D44)","v":0},22101000540017,22101000540017,0]
[16,"Traversa TK-9A","vnt.",17.7,null,{"$f":"(VLOOKUP(G45,Suvestine!B:D,3,0))*(E45*D45)","v":0},22101000540017,22101000540017,0]
[17,"Viršūnė IA","vnt.",12.3,null,{"$f":"(VLOOKUP(G46,Suvestine!B:D,3,0))*(E46*D46)","v":0},22101000540017,22101000540017,0]
[18,"Traversa IA","vnt.",30,null,{"$f":"(VLOOKUP(G47,Suvestine!B:D,3,0))*(E47*D47)","v":0},22101000540017,22101000540017,0]
[19,"Traversa I","vnt.",19.2,null,{"$f":"(VLOOKUP(G48,Suvestine!B:D,3,0))*(E48*D48)","v":0},22101000540017,22101000540017,0]
[20,"Traversa PTA","vnt.",14.6,null,{"$f":"(VLOOKUP(G49,Suvestine!B:D,3,0))*(E49*D49)","v":0},22101000540017,22101000540017,0]
[21,"Paaukštinimas TP-11","vnt.",77,null,{"$f":"(VLOOKUP(G50,Suvestine!B:D,3,0))*(E50*D50)","v":0},22101000540017,22101000540017,0]
[22,"Apkaba Ap-12-1,1-1","vnt.",0.6,null,{"$f":"(VLOOKUP(G51,Suvestine!B:D,3,0))*(E51*D51)","v":0},22101000540017,22101000540017,0]
[23,"Apkaba Ap-12-2,7","vnt.",0.7,null,{"$f":"(VLOOKUP(G52,Suvestine!B:D,3,0))*(E52*D52)","v":0},22101000540017,22101000540017,0]
[24,"Apkaba Ap-12-1,1-2","vnt.",0.6,null,{"$f":"(VLOOKUP(G53,Suvestine!B:D,3,0))*(E53*D53)","v":0},22101000540017,22101000540017,0]
[25,"Apkaba Ap-16-1,1-1","vnt.",0.9,null,{"$f":"(VLOOKUP(G54,Suvestine!B:D,3,0))*(E54*D54)","v":0},22101000540017,22101000540017,0]
[26,"Apkaba Ap-16-1,1-2","vnt.",1,null,{"$f":"(VLOOKUP(G55,Suvestine!B:D,3,0))*(E55*D55)","v":0},22101000540017,22101000540017,0]
[27,"Apkaba Ap-16-2,7","vnt.",1,null,{"$f":"(VLOOKUP(G56,Suvestine!B:D,3,0))*(E56*D56)","v":0},22101000540017,22101000540017,0]
[28,"Skyriklio laikiklis IS","vnt.",38.5,null,{"$f":"(VLOOKUP(G57,Suvestine!B:D,3,0))*(E57*D57)","v":0},22101000540017,22101000540017,0]
[null,"10kV skyrikliai ir jų dalys"]
[29,"Skyriklis 3RN-1-20-200M","vnt.",57.5,null,{"$f":"(VLOOKUP(G59,Suvestine!B:D,3,0))*(E59*D59)","v":0},22101000540017,22101000540017,0]
[30,"Skyriklis 3RN-2-20-200M","vnt.",95,null,{"$f":"(VLOOKUP(G60,Suvestine!B:D,3,0))*(E60*D60)","v":0},22101000540017,22101000540017,0]
{"$rows_left_out":285}
{"sheet":"Suvestine","index":1,"n_rows":24,"n_cols":6,"rows_kept":24,"cut":false,"hidden":false,"merged":[]}
[]
[{"$f":"'GM aktas'!A7","v":"1."},{"$f":"'GM aktas'!B7","v":"Rangovas"},{"$f":"'GM aktas'!C7","v":"pasirinkti"}]
[{"$f":"'GM aktas'!A9","v":"2."},{"$f":"'GM aktas'!B9","v":"Rangos darbų sutarties Nr."},{"$f":"'GM aktas'!C9","v":"Įveskite Sutarties Nr."}]
[{"$f":"'GM aktas'!A11","v":"3."},{"$f":"'GM aktas'!B11","v":"Rangos darbų užsakymo Nr. (iš TIVIS)"},{"$f":"'GM aktas'!C11","v":"Užpildyti"}]
[{"$f":"'GM aktas'!A13","v":"4."},{"$f":"'GM aktas'!B13","v":"Objekto pavadinimas pagal TIVIS:"},{"$f":"'GM aktas'!C13","v":"Užpildyti"}]
[{"$f":"'GM aktas'!A15","v":"5."},{"$f":"'GM aktas'!B15","v":"Investicinis Nr./Darbų Nr.  (iš TIVIS)"},{"$f":"'GM aktas'!C15","v":"Užpildyti"}]
[{"$f":"'GM aktas'!A16","v":"6."},{"$f":"'GM aktas'!B16","v":"Objekto Nr. (iš TIVIS)"},{"$f":"'GM aktas'!C16","v":"Užpildyti"}]
[{"$f":"'GM aktas'!A17","v":"7."},{"$f":"'GM aktas'!B17","v":"Grįžtamųjų medžiagų atsiradimo priežastis: "},{"$f":"'GM aktas'!C17","v":"pasirinkti"}]
[{"$f":"'GM aktas'!A19","v":"8."},{"$f":"'GM aktas'!B19","v":"GM akto pateikimo data:"},{"$f":"'GM aktas'!C19","v":"202x-xx-xx"}]
[{"$f":"'GM aktas'!A21","v":"9."},{"$f":"'GM aktas'!B21","v":"Atliktų darbų akto* pateikimo data:"},{"$f":"'GM aktas'!C21","v":"202x-xx-xx"}]
["Eil. Nr. ","Dynamics kodas","Rangovui parduodamos grįžtamosios medžiagos (prekės) kategorija","Kategorijos įkainis, Eur be PVM/kg","Kiekis viso, kg","Suma viso, Eur"]
[1,22101000540007,"Prekė - A tipo laidas",1.91,{"$f":"F12/D12","v":0},{"$f":"SUMIF('GM aktas'!$G$30:$G$334,B12,'GM aktas'!$F$30:$F$334)","v":0}]
[2,22101000540013,"Prekė - AS tipo laidas",1.0900000000000001,{"$f":"F13/D13","v":0},{"$f":"SUMIF('GM aktas'!$G$30:$G$334,B13,'GM aktas'!$F$30:$F$334)","v":0}]
[3,22101000550001,"Prekė - Al kabeliai su plastikine izoliacija",0.52,0,{"$f":"SUMIF('GM aktas'!$G$30:$G$334,B14,'GM aktas'!$F$30:$F$334)","v":0}]
[4,22101000550040,"Prekė - Al izoliuoti oro linijų laidai",0.74,0,{"$f":"SUMIF('GM aktas'!$G$30:$G$334,B15,'GM aktas'!$F$30:$F$334)","v":0}]
[5,22101000820112,"Prekė - medžiagos iš aliuminio, įkainių lentelėje nenurodytos 1-4 pozicijose",1.44,0,{"$f":"SUMIF('GM aktas'!$G$30:$G$334,B16,'GM aktas'!$F$30:$F$334)","v":0}]
[6,22101000550041,"Prekė iš vario",7.19,0,{"$f":"SUMIF('GM aktas'!$G$30:$G$334,B17,'GM aktas'!$F$30:$F$334)","v":0}]
[7,22101000540017,"Prekė iš plieno",0.23,0,{"$f":"SUMIF('GM aktas'!$G$30:$G$334,B18,'GM aktas'!$F$30:$F$334)","v":0}]
[8,22101000940060,"Prekė iš skardos",0.19,0,{"$f":"SUMIF('GM aktas'!$G$30:$G$334,B19,'GM aktas'!$F$30:$F$334)","v":0}]
[null,null,null,null,null,{"$f":"SUM(F12:F19)","v":0}]
[]
[]
[]
[null,null,null,{"$f":"IF(IF('GM aktas'!C23=\"Užpildyti\",\"\",'GM aktas'!C23)=0,C6,IF('GM aktas'!C23=\"Užpildyti\",\"\",'GM aktas'!C23))","v":""}]

{"sheet":"darbinis","index":2,"n_rows":418,"n_cols":13,"rows_kept":418,"cut":false,"hidden":true,"merged":[]}
["Grįžtamųjų medžiagų atsiradimo priežastis: ",null,null,null,null,null,null,null,"Techninis prižiūrėtojas","Skyrius"]
["pasirinkti",null,null,null,null,null,null,null,"Aleksandras Pozniakovas",47031]
["2525002 Įrenginių likvidavimas",null,null,null,null,null,null,null,"Algimantas Barkus",47031]
["6111007 Medžiagų nurašymas",null,null,null,null,null,null,null,"Algirdas Ruzveltas",43033]
[null,null,null,null,null,null,null,null,"Algis Mikelionis",46031]
[null,null,null,null,null,null,null,null,"Algis Sutkaitis",42033]
["Rangovui parduodamų grįžtamųjų medžiagų įkainiai",null,null,null,null,null,null,null,"Alius Giedraitis",46031]
[null,null,null,null,null,null,null,null,"Almantas Subačius",47031]
[null,"Galioja iki * :","2026-06-30",null,null,null,null,null,"Andrius Oleinikas",42033]
[null,null,null,null,null,null,null,null,"Antanas Magelinskas",45031]
["Eil. Nr. ","Rangovui parduodamos grįžtamosios medžiagos (prekės) kategorija","Kategorijos įkainis, Eur be PVM/kg","Dynamics","Scala kodas",null,null,null,"Arnas Januškonis",46031]
[1,"Prekė - A tipo laidas",1.91,22101000540007,45370102002,null,null,null,"Artūras Kmieliauskas",42031]
[2,"Prekė - AS tipo laidas",1.0900000000000001,22101000540013,45371002001,null,null,null,"Arūnas Rumša",42031]
[3,"Prekė - Al kabeliai su plastikine izoliacija",0.52,22101000550001,45030517502,null,null,null,"Arvydas Klapatauskas",43031]
[4,"Prekė - Al izoliuoti oro linijų laidai",0.74,22101000550040,45092002004,null,null,null,"Arvydas Skardžius",45031]
[5,"Prekė - medžiagos iš aliuminio, įkainių lentelėje nenurodytos 1-4 pozicijose",1.44,22101000820112,69250100001,null,null,null,"Dalia Petrauskienė",43033]
[6,"Prekė iš vario",7.19,22101000550041,69330502001,null,null,null,"Dalius Vaižmužis",45031]
[7,"Prekė iš plieno",0.23,22101000540017,67050100081,null,null,null,"Darius Virvilas",42033]
[8,"Prekė iš skardos",0.19,22101000940060,67154005004,null,null,null,"Donatas Mačerinskas",40270]
[null,null,null,null,null,null,null,null,"Egidijus Zasčiurinskas",40220]
["Rangovui  parduodamų grįžtamųjų medžiagų mato vienetų perskaičiavimas",null,null,null,null,null,null,null,"Evaldas Alimas",43033]
[null,null,null,null,null,null,null,null,"Gediminas Kubilius",46031]
["Eil. Nr.","Grįžtamosios medžiagos (prekės) pavadinimas","Mato vnt. ","Grįžtamosios medžiagos (prekės) 1 mato vnt. svoris, kg","Rangovui parduodamos grįžtamosios medžiagos (prekės) kategorija","Scala kodas",null,null,"Gintaras Krencius",43031]
[1,"Traversa T-1","vnt.",0.67,"Prekė iš plieno",22101000540017,null,null,"Gintautas Kaminskas",45031]
[2,"Traversa T-2","vnt.",1.71,"Prekė iš plieno",22101000540017,null,null,"Gintautas Taparauskas",42031]
[3,"Traversa I-1","vnt.",1.71,"Prekė iš plieno",22101000540017,null,null,"Jevgenijus Čaikinas",47031]
[4,"Traversa I-2","vnt.",3.9,"Prekė iš plieno",22101000540017,null,null,"Justas Marčiukaitis",42033]
[5,"Traversa K-1","vnt.",1.52,"Prekė iš plieno",22101000540017,null,null,"Martynas Šeškauskis",43033]
[6,"Traversa K-2","vnt.",3.61,"Prekė iš plieno",22101000540017,null,null,"Rimas Lazickas",45031]
[7,"Ramsčio konstrukcija PTM-1,1","vnt.",4.18,"Prekė iš plieno",22101000540017,null,null,"Rimgaudas Kreivėnas",46031]
[8,"Ramsčio konstrukcija PTM-2,7","vnt.",7.9799999999999995,"Prekė iš plieno",22101000540017,null,null,"Rita Barkauskienė",43036]
[9,"Viršūnė T","vnt.",3.52,"Prekė iš plieno",22101000540017,null,null,"Rolanas Jočys",42033]
[10,"Traversa T","vnt.",6.6499999999999995,"Prekė iš plieno",22101000540017,null,null,"Romualdas Leimontas",45032]
[11,"Viršūnė TA","vnt.",5.51,"Prekė iš plieno",22101000540017,null,null,"Saulius Urbanavičius",47031]
[12,"Traversa TA","vnt.",9.0299999999999994,"Prekė iš plieno",22101000540017,null,null,"Stasys Guobys",47031]
[13,"Viršūnė TK-9","vnt.",5.13,"Prekė iš plieno",22101000540017,null,null,"Tomas Vaicekavičius",42031]
[14,"Traversa TK-9","vnt.",15.01,"Prekė iš plieno",22101000540017,null,null,"Vaidotas Vaitkus",43033]
[15,"Viršūnė TK-9A","vnt.",8.7399999999999984,"Prekė iš plieno",22101000540017,null,null,"Valdas Perkauskas",42031]
[16,"Traversa TK-9A","vnt.",17.670000000000002,"Prekė iš plieno",22101000540017,null,null,"Valentas Strigūnas",43031]
[17,"Viršūnė IA","vnt.",12.35,"Prekė iš plieno",22101000540017,null,null,"Vidas Zmitrys",45031]
[18,"Traversa IA","vnt.",29.93,"Prekė iš plieno",22101000540017,null,null,"Vigandas Adomavičius",47031]
[19,"Traversa I","vnt.",19.29,"Prekė iš plieno",22101000540017,null,null,"Virginijus Čepulis",45031]
[20,"Traversa PTA","vnt.",14.629999999999999,"Prekė iš plieno",22101000540017,null,null,"Virginijus Jurkšaitis",45031]
[21,"Paaukštinimas TP-11","vnt.",76.95,"Prekė iš plieno",22101000540017,null,null,"Virginijus Norkus",43031]
[22,"Apkaba Ap-12-1,1-1","vnt.",0.56999999999999995,"Prekė iš plieno",22101000540017,null,null,"Vitalijus Januševičius",40250]
[23,"Apkaba Ap-12-2,7","vnt.",0.67,"Prekė iš plieno",22101000540017,null,null,"Vytautas Bagdonas",46031]
[24,"Apkaba Ap-12-1,1-2","vnt.",0.56999999999999995,"Prekė iš plieno",22101000540017,null,null,"Vytautas Kavaliauskas",46031]
[25,"Apkaba Ap-16-1,1-1","vnt.",0.86,"Prekė iš plieno",22101000540017,null,null,"Vytautas Lažaunykas",46031]
[26,"Apkaba Ap-16-1,1-2","vnt.",0.95,"Prekė iš plieno",22101000540017,null,null,"Vytautas Liubomirskas",45031]
[27,"Apkaba Ap-16-2,7","vnt.",1.05,"Prekė iš plieno",22101000540017,null,null,"Kitas"]
[28,"Skyriklio laikiklis IS","vnt.",38.479999999999997,"Prekė iš plieno",22101000540017]
[29,"Apskaitos spintos vienfazės 1 ir 2 apskaitos modulių","vnt.",9.5,"Prekė iš skardos",22101000940060]
[30,"Apskaitos spintos vienfazės 4 ir 6 apskaitų modulių","vnt.",21.849999999999998,"Prekė iš skardos",22101000940060]
[31,"Apskaitos spintos trifazės 1 apskaitos modulių","vnt.",9.5,"Prekė iš skardos",22101000940060]
[32,"Apskaitos spintos trifazės 2 apskaitų modulių","vnt.",14.25,"Prekė iš skardos",22101000940060]
[33,"Apskaitos spintos trifazės 4 apskaitų modulių","vnt.",36.1,"Prekė iš skardos",22101000940060]
[34,"Apskaitos spintos trifazės 6 apskaitų modulių","vnt.",45.599999999999994,"Prekė iš skardos",22101000940060]
[35,"Kabelių spintos be apskaitų modulių","vnt.",39.9,"Prekė iš skardos",22101000940060]
[36,"Kabelių spintos su 1 apskaitos moduliu","vnt.",47.5,"Prekė iš skardos",22101000940060]
[37,"Kabelių spintos su 2 apskaitos moduliu","vnt.",56.05,"Prekė iš skardos",22101000940060]
{"$rows_left_out":359}
{"sheet":"Rekvizitai","index":3,"n_rows":61,"n_cols":5,"rows_kept":61,"cut":false,"hidden":true,"merged":[]}
[null,"Rangovas","Adresas","Įmonės kodas","PVM kodas"]
["Anykščių energetinė statyba UAB","Uždaroji akcinė bendrovė „Anykščių energetinė statyba\"","Stoties g. 5, LT-29107 Anykščiai","Įmonės kodas: 154229968","PVM kodas: LT542299610"]
["ATP Baltic UAB","UAB „ATP Baltic“","Vaduvos g. 30C-32, LT-02307 Vilnius","Įmonės kodas: 303259235","PVM kodas: LT100008426016"]
["Elektra ir Co UAB","„Elektra ir Co“, UAB","Užtvankos g. 17, LT-74202 Dainiai","Įmonės kodas: 304214232","PVM kodas: LT100010503811"]
["Elektrifikacijos darbai UAB","Uždaroji akcinė bendrovė „ELEKTRIFIKACIJOS DARBAI“","P. Armino g. 71a, LT-68127 Marijampolė","Įmonės kodas: 151241673","PVM kodas: LT512416716"]
["Elektromontuotojas UAB","Uždaroji akcinė bendrovė „Elektromontuotojas“","Technikos g. 25, LT-51335 Kaunas","Įmonės kodas: 132439736","PVM kodas: LT324397314"]
["Elektros tinklas UAB","UAB „ELEKTROS TINKLAS“","Motorų g. 6, LT-02190, Vilnius","Įmonės kodas: 300541635","PVM kodas: LT100002248415"]
["Energika UAB","UAB „Energika“ ","Atramos g. 2, LT-47174 Kaunas ","Įmonės kodas: 303917434","PVM kodas: LT100009251716 "]
["Klaipėdos energetika AB","Akcinė bendrovė „KLAIPĖDOS ENERGETIKA“  ","Liepų 66, LT – 92100 Klaipėda ","Įmonės kodas: 140724749","PVM kodas: LT407247414"]
["TETAS UAB","UAB „TETAS“","Senamiesčio g. 102b, LT-35116 Panevėžys","Įmonės kodas: 300513148","PVM kodas: LT100002045610 "]
["Vilniaus energetinė statyba AB","AB „Vilniaus energetinė statyba“","Jočionių g. 53, LT-02053, Vilnius","Įmonės kodas: 222354530","PVM kodas: LT223545314"]
["Vytrita UAB","Uždaroji akcinė bendrovė „Vytrita“","Atramos g. 2, LT-47174 Kaunas ","Įmonės kodas: 133858826","PVM kodas: LT338588219 "]
["Indastrus UAB","UAB \"INDASTRUS\"","Pajuostė pl. 36, LT-36104, Panevėžys","Įmonės kodas: 148428467","PVM kodas: LT484284610 "]
["Apšvietimas UAB","Uždaroji akcinė bendrovė „Apšvietimas“","Perspektyvos g. 18, Kaunas ","Įmonės kodas: 132343314","PVM kodas: LT323433113"]
["EXTO UAB","UAB „Exto“","Pramonės g. 24G, Šiauliai","Įmonės kodas: 300557116","PVM kodas: LT100002735516"]
["Kugeta UAB","UAB „Kugeta“","Vytauto g. 71, 98121 Skuodas","Įmonės kodas: 273905010","PVM kodas: LT739050113"]
["Energo LT UAB","UAB „EnergoLT“","Stumbro g. 3, Šakių k, 47413 Kauno r.","Įmonės kodas: 302551560","PVM kodas: LT100005697314"]
["Vakarų energetika UAB","UAB \"Vakarų energetika\"","Gluosnio g. 11, Plikiai, 96231 Klaipėdos raj.","Įmonės kodas: 304048419","PVM kodas: LT100009511211"]
["Vadema UAB","UAB „Vadema“","Atramos g. 2, 47174 Kaunas ","Įmonės kodas: 249894650","PVM kodas: LT498946515"]
["Energostatika UAB","UAB „Energostatika“","Tartoko g. 5, Jašiūnų glž. st., LT-17251 Šalčininkų r.","Įmonės kodas: 303007711","PVM kodas: LT100007584418 "]
["Energetikos ranga UAB","UAB „Energetikos ranga\"","V. Nagevičiaus g. 3, 08237 Vilnius ","Įmonės kodas: 304758522","PVM kodas: LT100011447913 "]
["Fisanta UAB","UAB „Fisanta“","Varpo g. 25, 76298 Šiauliai","Įmonės kodas: 144951210","PVM kodas: LT449512113"]
["Elektros pajėgos UAB","UAB „Elektros pajėgos“","Saulėtekio g. 8, 19125 Širvintos","Įmonės kodas: 302598688","PVM kodas: LT100005967019"]
["Elektra UAB","UAB „Elektra“","Gedimino g. 24A, LT-21118 Trakai","Įmonės kodas: 181107267","PVM kodas: LT811072610"]
["Bosleta UAB","UAB „Bosleta“","Architektų g. 56-101, Vilnius","Įmonės kodas: 303280973","PVM kodas: LT100008583617"]
["Elmova UAB","UAB „Elmova\"","Goštautų g. 3, 48324 Kaunas","Įmonės kodas: 234007320","PVM kodas: LT340073219"]
["Elektrovoltas UAB","UAB „Elektrovoltas“","Pramonės g. 19, 87101 Telšiai","Įmonės kodas: 180703727","PVM kodas: LT807037219"]
["Elektrifikacijos paslaugos UAB","UAB „Elektrifikacijos paslaugos“","Šilutės pl. 107, 95112 Klaipėda","Įmonės kodas: 300014907","PVM kodas: LT100000947118"]
["Indastrus UAB","UAB „Indastrus“","Trakiškio g. 1, 35115 Panevėžys","Įmonės kodas: 148428467","PVM kodas: LT484284610"]
["Apšvietimas UAB","UAB „Apšvietimas“","Ateities pl. 45D, 52119 Kaunas","Įmonės kodas: 132343314","PVM kodas: LT323433113"]
["APS grupė UAB","UAB „APS grupė“","Kalvarijų g. 300, 08318 Vilnius","Įmonės kodas: 302498905","PVM kodas: LT100005360013"]
["Neiluva UAB","UAB „Neiluva“","Naugarduko g. 41A, 03227 Vilnius","Įmonės kodas: 121959187","PVM kodas: LT219591811"]
["A Žilinskio ir Ko UAB","UAB „A. Žilinskio ir Ko“","Užtvankos g. 17, Dainiai, 74202 Jurbarko r.","Įmonės kodas: 158102142","PVM kodas: LT581021411"]
["Aremsa UAB","UAB „Aremsa“","Partizanų g. 78-7, 50349 Kaunas","Įmonės kodas: 304295782","PVM kodas: LT100011364210"]
["Elektro LT UAB","UAB „Elektro LT\"","Taikos pr. 86-81, 51274 Kaunas","Įmonės kodas: 302291422","PVM kodas: LT100004476919"]
["Elektros darbai UAB","UAB „Elektros darbai“","Jonavos g. 62A, 44192 Kaunas","Įmonės kodas: 133619018","PVM kodas: LT336190113"]
["Elektros tinklų statyba AB","AB „Elektros tinklų statyba“","Motorų g. 4, 02190 Vilnius","Įmonės kodas: 111728584","PVM kodas: LT117285811"]
["Elmava UAB","UAB „Elmava“","P. Vileišio g. 6F, 10308 Vilnius","Įmonės kodas: 125390139","PVM kodas: LT253901314"]
["Elmonta UAB","UAB „Elmonta\"","Motorų g. 6, 02190 Vilnius","Įmonės kodas: 122217769","PVM kodas: LT100000013913"]
["Elvaradas UAB","UAB „Elvaradas“","J.Basanavičiaus g. 23-2, 75124 Šilalė","Įmonės kodas: 176633746","PVM kodas: LT766337419"]
["Energetikos tinklų institutas AB","AB „Energetikos tinklų institutas“","Kampo g. 7, 50153 Kaunas","Įmonės kodas: 132129036","PVM kodas: LT321290314"]
["Energijos skirstymo operatorius AB","AB „Energijos skirstymo operatorius“","Laisvės pr. 10, LT-04215 Vilnius ","Įmonės kodas: 304151376","PVM kodas: LT100009860612"]
["EnergoLT UAB","UAB „EnergoLT“","Stumbro g. 3, Šakių k, 47413 Kauno r.","Įmonės kodas: 302551560","PVM kodas: LT100005697314"]
["Eresta UAB","UAB „Eresta“","Sakalaičių sodų 6-oji g.31, 02216 Vilnius","Įmonės kodas: 301490670","PVM kodas: LT100003688819"]
["ES Energy UAB","UAB „ES Energy“","Islandijos pl. 217-8, 49165 Kaunas ","Įmonės kodas: 305997621","PVM kodas: LT100014710718"]
["Jarkesta UAB","UAB „Jarkesta“","Senkelio g. 6A, Narezkai, LT-21143 Trakų r.","Įmonės kodas: 300555179","PVM kodas: "]
["Kalistara UAB","UAB „Kalistara“","Išradėjų g. 13B, 78149 Šiauliai","Įmonės kodas: 300665864","PVM kodas: LT100004354518 "]
["Nekta IĮ","IĮ „Nekta“","Pergalės g. 9-36, 26127 Elektrėnai","Įmonės kodas: 300008605","PVM kodas: LT100000889712"]
["Statkorpas AB","Statkorpas, AB","Savitiškio g. 10F, 37371 Panevėžys","Įmonės kodas: 147651620","PVM kodas: LT476516219"]
["Stiemo UAB","UAB „Stiemo“","Islandijos pl. 217-8, LT-49165 Kaunas","Įmonės kodas: 303477554","PVM kodas: LT100009412718"]
["Šiaulių Rymonta UAB","UAB „Šiaulių Rymonta“","Smėlynės g. 112, LT-35113 Panevėžys","Įmonės kodas: 145841261","PVM kodas: LT458412610"]
["Vytmarca MB","MB „Vytmarca“","Girelės g. 4, 56133 Kaišiadorys","Įmonės kodas: 304603397","PVM kodas: LT100011251919"]
["Žemaitijos energetika UAB","UAB „Žemaitijos energetika“","Deltuvos g. 24, 20118 Ukmergė","Įmonės kodas: 180709370","PVM kodas: LT807093716"]
["Žilinskis ir Co UAB","UAB „Žilinskis ir Co“","Ateities pl. 31, LT-52167 Kaunas","Įmonės kodas: 304317232","PVM kodas: LT100010333316"]
["Hidro Elektra UAB","UAB „Hidro Elektra“","Polocko g. 17-54, LT-01205 Vilnius","Įmonės kodas: 305441603","PVM kodas: LT100012945712"]
["Labas GAS UAB","UAB „Labas GAS“","Ateities pl. 45A, 52119 Kaunas","Įmonės kodas: 124552684","PVM kodas: LT245526811"]
["Alkesta UAB","UAB „Alkesta\"","Naujoji g. 118, 62175 Alytus ","Įmonės kodas: 249672710","PVM kodas: LT496727113"]
["Pažangi energetika UAB","UAB „Pažangi energetika\"","Nevėžio g. 31, LT-58158, Paobelio k. Kėdainių raj.","Įmonės kodas: 305564755","PVM kodas: LT457300010163496626"]
["Skominta UAB","UAB „Skominta“","Naugarduko 97, 03202 Vilnius","Įmonės kodas: 147895076","PVM kodas: LT478950716"]
["Vilniaus inžinerija UAB","UAB „Vilniaus inžinerija“","Visorių Sodų 15-oji g. 28, 08451 Vilnius","Įmonės kodas: 303049703","PVM kodas: LT100009659010"]
{"$rows_left_out":1}