{"text_format":"1","workbook":"xlsx","n_sheets":4,"sheets":["GM aktas","Suvestine","darbinis","Rekvizitai"],"not_rendered":{"charts":0,"images":0,"macros":1,"external_links":0,"defined_names":27,"comments":0,"pivot_tables":0},"unopened":[],"bounds":{"document_bytes":16777216,"sheet_cells":100000,"rows_first":2000,"rows_last":500,"rows_between":2000,"halvings":0,"cell_chars":16384,"cell_head_chars":4096},"cells_cut":0,"cells_raw":0,"read":"whole","date_system":"1900"}

{"sheet":"GM aktas","index":0,"n_rows":60,"n_cols":16,"rows_kept":60,"cut":false,"hidden":false,"merged":[[1,0,1,10],[2,0,2,10],[3,0,3,10],[16,2,16,4],[18,2,18,4],[20,2,20,4],[55,8,55,9],[58,8,58,9],[6,2,6,4],[8,2,8,4],[10,2,10,4],[12,2,12,4],[14,2,14,4],[22,2,22,4]]}
[null,null,null,null,null,null,null,null,"Priedas Nr. 2","Priedas Nr. 2","Priedas Nr. 2"]
["GRĮŽTAMŲJŲ MEDŽIAGŲ AKTAS"]
["Rangovui parduodamoms medžiagoms"]
["Akto forma galioja iki 2026.12.31"]
[]
[]
["1.","Rangovas","pasirinkti",null,null,null,{"$f":"IF($C$7=\"pasirinkti\",\"\",\"Rangovas\")","v":""}]
[]
["2.","Rangos darbų sutarties Nr.","Įveskite Sutraties Nr.",null,null,null,{"$f":"IF($C$7=\"pasirinkti\",\"\",VLOOKUP($C$7,Rekvizitai!$A:$E,2,0))","v":""}]
[]
["3.","Rangos darbų užsakymo Nr. (iš TIVIS)","Užpildyti",null,null,null,{"$f":"IF($C$7=\"pasirinkti\",\"\",VLOOKUP($C$7,Rekvizitai!$A:$E,3,0))","v":""}]
[]
["4.","Objekto pavadinimas pagal TIVIS:","Užpildyti",null,null,null,{"$f":"IF($C$7=\"pasirinkti\",\"\",VLOOKUP($C$7,Rekvizitai!$A:$E,4,0))","v":""}]
[]
["5.","Projekto investicinis Nr./Objekto Nr.  ","Užpildyti",null,null,null,{"$f":"IF($C$7=\"pasirinkti\",\"\",VLOOKUP($C$7,Rekvizitai!$A:$E,5,0))","v":""}]
[]
["6.","Grįžtamųjų medžiagų atsiradimo priežastis: ","pasirinkti"]
[]
["7.","GM akto pateikimo data:","202X-xx-xx",null,null,null,"Pardavėjas:"]
[]
["8.","Atliktų darbų akto* pateikimo data:","202X-xx-xx",null,null,null,"AB „Energijos skirstymo operatorius“",null,null,null,null,null,null,null,null,{"$f":"((IF(C9=\"PASIRINKTI\",1,0))+(IF(C7=\"PASIRINKTI\",1,0))+(IF(C11=\"UŽPILDYTI\",1,0))+(IF(C13=\"UŽPILDYTI\",1,0))+(IF(C15=\"UŽPILDYTI\",1,0))+(IF(C17=\"PASIRINKTI\",1,0))+(IF(C19=\"202X-XX-XX\",1,0))+(IF(C21=\"202X-XX-XX\",1,0))+(IF(C19>TODAY(),1,0))+(IF(I59=\"\",1,0))+(IF(I56=\"\",1,0)))+(SUM(M29:M50))+P23","v":10}]
[null,null,null,null,null,null,"Laisvės pr. 10, LT-04215 Vilnius "]
["9.","Objekto Inventorinis Nr.","Užpildyti",null,null,null,"Įmonės kodas 304151376",null,null,null,null,null,null,null,null,{"$f":"IF(C17<>\"2525002 Rekonstravimas\",0,IF(C23=\"užpildyti\",1,IF(C23=\"\",1,0)))","v":0}]
["*įkainių taikymo laikotarpis nustatomas pagal Atliktų darbų akto pateikimo Užsakovui datą.",null,null,null,null,null,"PVM kodas LT100009860612"]
[]
[]
[]
["Grįžtamosios medžiagos (grupės) pavadinimas (1)","Grįžtamosios medžiagos (prekės) pavadinimas (2)","Kiekis","Diametras (išorinis), mm","Diametras (vidinis), mm","Ilgis, m","Grįžtamosios medžiagos (prekės) 1 mato vnt. svoris, kg","Tūris, m3","Suma, Eur be PVM\n","Inventorinis Nr.","Scala kodas"]
["pasirinkti","pasirinkti",null,null,null,null,{"$f":"IFERROR(IF(A29=\"DUJOTIEKIS\",H29*7800,((VLOOKUP(A29&B29,darbinis!$G$38:$M$88,7,0)*C29))),0)","v":0},{"$f":"3.14*(((D29+E29)/2)/1000)*((D29-E29)/2/1000)*F29","v":0},{"$f":"IFERROR(IF(A29<>\"DUJOTIEKIS\",((VLOOKUP(A29&B29,darbinis!$G$38:$M$88,7,0))*C29)*Suvestine!$D$12,((VLOOKUP(B29,darbinis!B:C,2,0))*G29)),\"\")","v":""},null,67050100081,{"$f":"IF(A29=\"pasirinkti\",\"\",IF(A29<>\"Dujotiekis\",IF(G29=0,\"Užpildykite visus duomenys (Nuspalvinta mėlynai)\",\"\"),IF(I29>0,\"\",\"Užpildykite visus duomenys (Nuspalvinta mėlynai)\")))","v":""},{"$f":"IF(L29=\"Užpildykite visus duomenys (Nuspalvinta mėlynai)\",1,0)","v":0}]
["pasirinkti","pasirinkti",null,null,null,null,{"$f":"IFERROR(IF(A30=\"DUJOTIEKIS\",H30*7800,((VLOOKUP(A30&B30,darbinis!$G$38:$M$88,7,0)*C30))),0)","v":0},{"$f":"3.14*(((D30+E30)/2)/1000)*((D30-E30)/2/1000)*F30","v":0},{"$f":"IFERROR(IF(A30<>\"DUJOTIEKIS\",((VLOOKUP(A30&B30,darbinis!$G$38:$M$88,7,0))*C30)*Suvestine!$D$12,((VLOOKUP(B30,darbinis!B:C,2,0))*G30)),\"\")","v":""},null,67050100081,{"$f":"IF(A30=\"pasirinkti\",\"\",IF(A30<>\"Dujotiekis\",IF(G30=0,\"Užpildykite visus duomenys (Nuspalvinta mėlynai)\",\"\"),IF(I30>0,\"\",\"Užpildykite visus duomenys (Nuspalvinta mėlynai)\")))","v":""},{"$f":"IF(L30=\"Užpildykite visus duomenys (Nuspalvinta mėlynai)\",1,0)","v":0}]
["pasirinkti","pasirinkti",null,null,null,null,{"$f":"IFERROR(IF(A31=\"DUJOTIEKIS\",H31*7800,((VLOOKUP(A31&B31,darbinis!$G$38:$M$88,7,0)*C31))),0)","v":0},0,{"$f":"IFERROR(IF(A31<>\"DUJOTIEKIS\",((VLOOKUP(A31&B31,darbinis!$G$38:$M$88,7,0))*C31)*Suvestine!$D$12,((VLOOKUP(B31,darbinis!B:C,2,0))*G31)),\"\")","v":""},null,67050100081,"",0]
["pasirinkti","pasirinkti",null,null,null,null,{"$f":"IFERROR(IF(A32=\"DUJOTIEKIS\",H32*7800,((VLOOKUP(A32&B32,darbinis!$G$38:$M$88,7,0)*C32))),0)","v":0},0,{"$f":"IFERROR(IF(A32<>\"DUJOTIEKIS\",((VLOOKUP(A32&B32,darbinis!$G$38:$M$88,7,0))*C32)*Suvestine!$D$12,((VLOOKUP(B32,darbinis!B:C,2,0))*G32)),\"\")","v":""},null,67050100081,"",0]
["pasirinkti","pasirinkti",null,null,null,null,{"$f":"IFERROR(IF(A33=\"DUJOTIEKIS\",H33*7800,((VLOOKUP(A33&B33,darbinis!$G$38:$M$88,7,0)*C33))),0)","v":0},0,{"$f":"IFERROR(IF(A33<>\"DUJOTIEKIS\",((VLOOKUP(A33&B33,darbinis!$G$38:$M$88,7,0))*C33)*Suvestine!$D$12,((VLOOKUP(B33,darbinis!B:C,2,0))*G33)),\"\")","v":""},null,67050100081,"",0]
["pasirinkti","pasirinkti",null,null,null,null,{"$f":"IFERROR(IF(A34=\"DUJOTIEKIS\",H34*7800,((VLOOKUP(A34&B34,darbinis!$G$38:$M$88,7,0)*C34))),0)","v":0},0,{"$f":"IFERROR(IF(A34<>\"DUJOTIEKIS\",((VLOOKUP(A34&B34,darbinis!$G$38:$M$88,7,0))*C34)*Suvestine!$D$12,((VLOOKUP(B34,darbinis!B:C,2,0))*G34)),\"\")","v":""},null,67050100081,"",0]
["pasirinkti","pasirinkti",null,null,null,null,{"$f":"IFERROR(IF(A35=\"DUJOTIEKIS\",H35*7800,((VLOOKUP(A35&B35,darbinis!$G$38:$M$88,7,0)*C35))),0)","v":0},0,{"$f":"IFERROR(IF(A35<>\"DUJOTIEKIS\",((VLOOKUP(A35&B35,darbinis!$G$38:$M$88,7,0))*C35)*Suvestine!$D$12,((VLOOKUP(B35,darbinis!B:C,2,0))*G35)),\"\")","v":""},null,67050100081,"",0]
["pasirinkti","pasirinkti",null,null,null,null,{"$f":"IFERROR(IF(A36=\"DUJOTIEKIS\",H36*7800,((VLOOKUP(A36&B36,darbinis!$G$38:$M$88,7,0)*C36))),0)","v":0},0,{"$f":"IFERROR(IF(A36<>\"DUJOTIEKIS\",((VLOOKUP(A36&B36,darbinis!$G$38:$M$88,7,0))*C36)*Suvestine!$D$12,((VLOOKUP(B36,darbinis!B:C,2,0))*G36)),\"\")","v":""},null,67050100081,"",0]
["pasirinkti","pasirinkti",null,null,null,null,{"$f":"IFERROR(IF(A37=\"DUJOTIEKIS\",H37*7800,((VLOOKUP(A37&B37,darbinis!$G$38:$M$88,7,0)*C37))),0)","v":0},0,{"$f":"IFERROR(IF(A37<>\"DUJOTIEKIS\",((VLOOKUP(A37&B37,darbinis!$G$38:$M$88,7,0))*C37)*Suvestine!$D$12,((VLOOKUP(B37,darbinis!B:C,2,0))*G37)),\"\")","v":""},null,67050100081,"",0]
["pasirinkti","pasirinkti",null,null,null,null,{"$f":"IFERROR(IF(A38=\"DUJOTIEKIS\",H38*7800,((VLOOKUP(A38&B38,darbinis!$G$38:$M$88,7,0)*C38))),0)","v":0},0,{"$f":"IFERROR(IF(A38<>\"DUJOTIEKIS\",((VLOOKUP(A38&B38,darbinis!$G$38:$M$88,7,0))*C38)*Suvestine!$D$12,((VLOOKUP(B38,darbinis!B:C,2,0))*G38)),\"\")","v":""},null,67050100081,"",0]
["pasirinkti","pasirinkti",null,null,null,null,{"$f":"IFERROR(IF(A39=\"DUJOTIEKIS\",H39*7800,((VLOOKUP(A39&B39,darbinis!$G$38:$M$88,7,0)*C39))),0)","v":0},0,{"$f":"IFERROR(IF(A39<>\"DUJOTIEKIS\",((VLOOKUP(A39&B39,darbinis!$G$38:$M$88,7,0))*C39)*Suvestine!$D$12,((VLOOKUP(B39,darbinis!B:C,2,0))*G39)),\"\")","v":""},null,67050100081,"",0]
["pasirinkti","pasirinkti",null,null,null,null,{"$f":"IFERROR(IF(A40=\"DUJOTIEKIS\",H40*7800,((VLOOKUP(A40&B40,darbinis!$G$38:$M$88,7,0)*C40))),0)","v":0},0,{"$f":"IFERROR(IF(A40<>\"DUJOTIEKIS\",((VLOOKUP(A40&B40,darbinis!$G$38:$M$88,7,0))*C40)*Suvestine!$D$12,((VLOOKUP(B40,darbinis!B:C,2,0))*G40)),\"\")","v":""},null,67050100081,"",0]
["pasirinkti","pasirinkti",null,null,null,null,{"$f":"IFERROR(IF(A41=\"DUJOTIEKIS\",H41*7800,((VLOOKUP(A41&B41,darbinis!$G$38:$M$88,7,0)*C41))),0)","v":0},0,{"$f":"IFERROR(IF(A41<>\"DUJOTIEKIS\",((VLOOKUP(A41&B41,darbinis!$G$38:$M$88,7,0))*C41)*Suvestine!$D$12,((VLOOKUP(B41,darbinis!B:C,2,0))*G41)),\"\")","v":""},null,67050100081,"",0]
["pasirinkti","pasirinkti",null,null,null,null,{"$f":"IFERROR(IF(A42=\"DUJOTIEKIS\",H42*7800,((VLOOKUP(A42&B42,darbinis!$G$38:$M$88,7,0)*C42))),0)","v":0},0,{"$f":"IFERROR(IF(A42<>\"DUJOTIEKIS\",((VLOOKUP(A42&B42,darbinis!$G$38:$M$88,7,0))*C42)*Suvestine!$D$12,((VLOOKUP(B42,darbinis!B:C,2,0))*G42)),\"\")","v":""},null,67050100081,"",0]
["pasirinkti","pasirinkti",null,null,null,null,{"$f":"IFERROR(IF(A43=\"DUJOTIEKIS\",H43*7800,((VLOOKUP(A43&B43,darbinis!$G$38:$M$88,7,0)*C43))),0)","v":0},0,{"$f":"IFERROR(IF(A43<>\"DUJOTIEKIS\",((VLOOKUP(A43&B43,darbinis!$G$38:$M$88,7,0))*C43)*Suvestine!$D$12,((VLOOKUP(B43,darbinis!B:C,2,0))*G43)),\"\")","v":""},null,67050100081,"",0]
["pasirinkti","pasirinkti",null,null,null,null,{"$f":"IFERROR(IF(A44=\"DUJOTIEKIS\",H44*7800,((VLOOKUP(A44&B44,darbinis!$G$38:$M$88,7,0)*C44))),0)","v":0},0,{"$f":"IFERROR(IF(A44<>\"DUJOTIEKIS\",((VLOOKUP(A44&B44,darbinis!$G$38:$M$88,7,0))*C44)*Suvestine!$D$12,((VLOOKUP(B44,darbinis!B:C,2,0))*G44)),\"\")","v":""},null,67050100081,"",0]
["pasirinkti","pasirinkti",null,null,null,null,{"$f":"IFERROR(IF(A45=\"DUJOTIEKIS\",H45*7800,((VLOOKUP(A45&B45,darbinis!$G$38:$M$88,7,0)*C45))),0)","v":0},0,{"$f":"IFERROR(IF(A45<>\"DUJOTIEKIS\",((VLOOKUP(A45&B45,darbinis!$G$38:$M$88,7,0))*C45)*Suvestine!$D$12,((VLOOKUP(B45,darbinis!B:C,2,0))*G45)),\"\")","v":""},null,67050100081,"",0]
["pasirinkti","pasirinkti",null,null,null,null,{"$f":"IFERROR(IF(A46=\"DUJOTIEKIS\",H46*7800,((VLOOKUP(A46&B46,darbinis!$G$38:$M$88,7,0)*C46))),0)","v":0},0,{"$f":"IFERROR(IF(A46<>\"DUJOTIEKIS\",((VLOOKUP(A46&B46,darbinis!$G$38:$M$88,7,0))*C46)*Suvestine!$D$12,((VLOOKUP(B46,darbinis!B:C,2,0))*G46)),\"\")","v":""},null,67050100081,"",0]
["pasirinkti","pasirinkti",null,null,null,null,{"$f":"IFERROR(IF(A47=\"DUJOTIEKIS\",H47*7800,((VLOOKUP(A47&B47,darbinis!$G$38:$M$88,7,0)*C47))),0)","v":0},0,{"$f":"IFERROR(IF(A47<>\"DUJOTIEKIS\",((VLOOKUP(A47&B47,darbinis!$G$38:$M$88,7,0))*C47)*Suvestine!$D$12,((VLOOKUP(B47,darbinis!B:C,2,0))*G47)),\"\")","v":""},null,67050100081,"",0]
["pasirinkti","pasirinkti",null,null,null,null,{"$f":"IFERROR(IF(A48=\"DUJOTIEKIS\",H48*7800,((VLOOKUP(A48&B48,darbinis!$G$38:$M$88,7,0)*C48))),0)","v":0},0,{"$f":"IFERROR(IF(A48<>\"DUJOTIEKIS\",((VLOOKUP(A48&B48,darbinis!$G$38:$M$88,7,0))*C48)*Suvestine!$D$12,((VLOOKUP(B48,darbinis!B:C,2,0))*G48)),\"\")","v":""},null,67050100081,"",0]
["pasirinkti","pasirinkti",null,null,null,null,{"$f":"IFERROR(IF(A49=\"DUJOTIEKIS\",H49*7800,((VLOOKUP(A49&B49,darbinis!$G$38:$M$88,7,0)*C49))),0)","v":0},0,{"$f":"IFERROR(IF(A49<>\"DUJOTIEKIS\",((VLOOKUP(A49&B49,darbinis!$G$38:$M$88,7,0))*C49)*Suvestine!$D$12,((VLOOKUP(B49,darbinis!B:C,2,0))*G49)),\"\")","v":""},null,67050100081,"",0]
["pasirinkti","pasirinkti",null,null,null,null,{"$f":"IFERROR(IF(A50=\"DUJOTIEKIS\",H50*7800,((VLOOKUP(A50&B50,darbinis!$G$38:$M$88,7,0)*C50))),0)","v":0},0,{"$f":"IFERROR(IF(A50<>\"DUJOTIEKIS\",((VLOOKUP(A50&B50,darbinis!$G$38:$M$88,7,0))*C50)*Suvestine!$D$12,((VLOOKUP(B50,darbinis!B:C,2,0))*G50)),\"\")","v":""},null,67050100081,"",0]
[null,null,null,null,null,null,"iš viso:",null,{"$f":"SUM(I29:I50)","v":0}]
[null,"prekė iš plieno* - demontuotas plieninis dujotiekis, kuris nėra padengtas bitumine ir/ar polietilenine danga"]
[null,"prekė iš nerūšiuoto metalo laužo** - demontuotas plieninis dujotiekis, kuris yra padengtas bitumine ir/ar polietilenine danga"]
[]
[]
[null,"Atsakingas asmuo\n(Techninis prižiūrėtojas)"]
[null,null,null,null,null,null,null,null,"Vardas, pavardė, parašas"]
[]
[null,"Darbų vykdytojas\n(Rangovas)"]
[null,null," ",null,null,null,null,null,"Vardas, pavardė, parašas"]
{"$rows_left_out":1}
{"sheet":"Suvestine","index":1,"n_rows":24,"n_cols":6,"rows_kept":24,"cut":false,"hidden":false,"merged":[]}
[]
[{"$f":"'GM aktas'!A7","v":"1."},{"$f":"'GM aktas'!B7","v":"Rangovas"},{"$f":"'GM aktas'!C7","v":"pasirinkti"}]
[{"$f":"'GM aktas'!A9","v":"2."},{"$f":"'GM aktas'!B9","v":"Rangos darbų sutarties Nr."},{"$f":"'GM aktas'!C9","v":"Įveskite Sutraties Nr."}]
[{"$f":"'GM aktas'!A11","v":"3."},{"$f":"'GM aktas'!B11","v":"Rangos darbų užsakymo Nr. (iš TIVIS)"},{"$f":"'GM aktas'!C11","v":"Užpildyti"}]
[{"$f":"'GM aktas'!A13","v":"4."},{"$f":"'GM aktas'!B13","v":"Objekto pavadinimas pagal TIVIS:"},{"$f":"'GM aktas'!C13","v":"Užpildyti"}]
[{"$f":"'GM aktas'!A15","v":"5."},{"$f":"'GM aktas'!B15","v":"Projekto investicinis Nr./Objekto Nr.  "},{"$f":"'GM aktas'!C15","v":"Užpildyti"}]
[{"$f":"'GM aktas'!A17","v":"6."},{"$f":"'GM aktas'!B17","v":"Grįžtamųjų medžiagų atsiradimo priežastis: "},{"$f":"'GM aktas'!C17","v":"pasirinkti"}]
[{"$f":"'GM aktas'!A19","v":"7."},{"$f":"'GM aktas'!B19","v":"GM akto pateikimo data:"},{"$f":"'GM aktas'!C19","v":"202X-xx-xx"}]
[{"$f":"'GM aktas'!A21","v":"8."},{"$f":"'GM aktas'!B21","v":"Atliktų darbų akto* pateikimo data:"},{"$f":"'GM aktas'!C21","v":"202X-xx-xx"}]
[]
["Eil. Nr. ","Dynamics kodas","Rangovui parduodamos grįžtamosios medžiagos (prekės) kategorija","Kategorijos įkainis, Eur be PVM/kg","Kiekis viso, kg","Suma viso, Eur"]
[1,22101000540017,"Prekė iš plieno*",0.25,{"$f":"F12/D12","v":0},{"$f":"SUMIF('GM aktas'!B29:B50,\"<>Prekė iš nerūšiuoto metalo laužo**\",'GM aktas'!I29:I50)","v":0}]
[2,22101000820539,"Prekė iš nerūšiuoto metalo laužo**",0.21,{"$f":"F13/D13","v":0},{"$f":"SUMIF('GM aktas'!B29:B50,\"Prekė iš nerūšiuoto metalo laužo**\",'GM aktas'!I29:I50)","v":0}]
[null,null,null,null,null,{"$f":"SUM(F12:F13)","v":0}]
[]
[]
["prekė iš plieno* - demontuotas plieninis dujotiekis, kuris nėra padengtas bitumine ir/ar polietilenine danga"]
["prekė iš nerūšiuoto metalo laužo** - demontuotas plieninis dujotiekis, kuris yra padengtas bitumine ir/ar polietilenine danga"]
[]
[]
[]
[]
[]
[null,null,null,{"$f":"IF(IF('GM aktas'!C23=\"Užpildyti\",\"\",'GM aktas'!C23)=0,C6,IF('GM aktas'!C23=\"Užpildyti\",\"\",'GM aktas'!C23))","v":""}]

{"sheet":"darbinis","index":2,"n_rows":88,"n_cols":17,"rows_kept":88,"cut":false,"hidden":true,"merged":[[19,16,20,16]]}
["Grįžtamųjų medžiagų atsiradimo priežastis: "]
["pasirinkti",null,"pasirinkti",null,null,null,null,"pasirinkti"]
["6113013 Techninė priežiūra     ",null,"Rekonstrukcija – 1087",null,null,null,null,"Dujotiekis"]
["6113013 Remontas",null,"Remontas/Techninė priežiūra – 2327",null,null,null,null,"Žymėjimo ženklų tvirtinimo stulpelis"]
["2525002 Rekonstravimas, įrenginių likvidavimas",null,null,null,"Pasirinkti",null,null,"DSRĮt spintelė metalinė"]
[null,null,null,null,"Prekė iš plieno*",null,null,"Kamštinis uždarymo įtaisas"]
["Rangovui parduodamų grįžtamųjų medžiagų įkainiai",null,null,null,"Prekė iš nerūšiuoto metalo laužo**",null,null,"Kompensatorius"]
[null,null,null,null,null,null,null,"Rutulinis uždarymo įtaisas"]
[null,"Galioja iki * :","2026.12.31",null,null,null,null,"Flanšinis pleištinis uždarymo įtaisas"]
[null,null,null,null,null,null,null,"Šulinys"]
["Eil. Nr. ","Rangovui parduodamos grįžtamosios medžiagos (prekės) kategorija","Kategorijos įkainis, Eur be PVM/kg","Scala kodas",null,null,null,"Šulinėlis"]
[1,"Prekė iš plieno**",0.25,22101000540017,null,null,null,"Įvirinimas pleištinis uždarymo įtaisas"]
[2,"Prekė iš nerūšiuoto metalo laužo**",0.21,22101000820539]
[null,"Pasirinkti"]
["Rangovui  parduodamų grįžtamųjų medžiagų mato vienetų perskaičiavimas"]
[]
[]
[]
[]
[null,null,"Rangos darbų sutarties Nr.",null,"UAB Geovizija","40410/530102",null,"Dujotiekis","Dujotiekio įtaiso ženklo stovas reperis","DSRĮt spintelė metalinė","Kamštinis uždarymo įtaisas","Kompensatorius","Rutulinis uždarymo įtaisas","Flanšinis pleištinis uždarymo įtaisas","Šulinys","Įvirinimas pleištinis uždarymo įtaisas","Šulinėlis"]
[null,"Rangovas","pasirinkti",null,"UAB Geovizija","40700/530125",null,"Pasirinkti","Pasirinkti","Pasirinkti","Pasirinkti","Pasirinkti","Pasirinkti","Pasirinkti","Pasirinkti","Pasirinkti"]
[null,null,null,null,"UAB Geovizija","40410/521020",null,"Prekė iš plieno*","Dujotiekio įtaiso ženklo stovas (reperis)","DSRĮt spintelė (metalinė)","Uždarymo įtaisas DN50","Kompensatorius DN 125","Uždarymo įtaisas DN50","Uždarymo įtaisas DN50 ","Šulinio PL dangtis (apvalus)","Uždarymo įtaisas DN50  ","pasirinkti"]
[null,null,null,null,null,null,null,"Prekė iš nerūšiuoto metalo laužo**",null,null,"Uždarymo įtaisas DN65","Kompensatorius DN200","Uždarymo įtaisas DN65","Uždarymo įtaisas  DN80 ","Šulinio PL dangtis (kvadratinis)","Uždarymo įtaisas  DN80  ","Šulinėlis PL mažas (kapa)"]
[null,null,null,null,null,null,null,null,null,null,"Uždarymo įtaisas DN80","Kompensatorius DN250","Uždarymo įtaisas DN80","Uždarymo įtaisas  DN100","Šulinio PL žiedas ","Uždarymo įtaisas  DN100 ","Šulinėlis PL didelis (kapa)"]
[null,null,null,null,null,null,null,null,null,null,"Uždarymo įtaisas DN80(su flanšu)","Kompensatorius DN300","Uždarymo įtaisas DN100","Uždarymo įtaisas  DN150 ",null,"Uždarymo įtaisas  DN125 "]
[null,null,null,null,null,null,null,null,null,null,"Uždarymo įtaisas DN100(su flanšu)","Kompensatorius DN350","Uždarymo įtaisas DN125","Uždarymo įtaisas  DN200 ",null,"Uždarymo įtaisas DN150 "]
[null,null,null,null,null,null,null,null,null,null,"Uždarymo įtaisas DN150(su flanšu)","Kompensatorius DN400","Uždarymo įtaisas DN150","Uždarymo įtaisas  DN250",null,"Uždarymo įtaisas  DN200 "]
[null,null,null,null,"UAB Asirinta","40700/521945",null,null,null,null,null,"Kompensatorius DN500","Uždarymo įtaisas DN200","Uždarymo įtaisas  DN300",null,"Uždarymo įtaisas  DN250 "]
[null,null,null,null,null,null,null,null,null,null,null,"Kompensatorius DN600","Uždarymo įtaisas DN250","Uždarymo įtaisas DN350 ",null,"Uždarymo įtaisas  DN300 "]
[null,null,null,null,null,null,null,null,null,null,null,null,"Uždarymo įtaisas DN300","Uždarymo įtaisas  DN400 (su reduktoriumi) "]
[null,null,null,null,null,null,null,null,null,null,null,null,null,"Uždarymo įtaisas  DN500 (su reduktoriumi) "]
[]
[null,"UAB Para","40410/501349"]
[null,"UAB Para","40410/501345"]
[null,"UAB Para","40410/501348"]
[null,null,null,null,null,null,null,{"$f":"_xlfn.CONCAT(G39:H39)","v":"DujotiekisPrekės iš plienoPrekės iš plieno"}]
[null,"UAB Rimgauda","40410/500801"]
[null,"UAB Rimgauda","40410/500808",null,null,null,null,"Medžiaga","Diametras (išorinis), mm","Diametras (vidinis), mm","Ilgis, m","Kiekis, vnt.","Svoris, kg","Įkainis, Eur (nuo metalo įkainio? )"]
[null,"UAB Rimgauda","40410/500809",null,null,null,"DujotiekisPrekės iš plieno","Prekės iš plieno","+","+"]
[null,null,null,null,"UAB DS1","40700/530012","DujotiekisPrekės iš nerūšiuoto metalo","Prekės iš nerūšiuoto metalo","+","+"]
[null,"UAB Skominta","40410/502027",null,"UAB DS1","40410/501400","ŠulinėlisŠulinėlis PL mažas (kapa)","Šulinėlis PL mažas (kapa)",null,null,"+","+",18.600000000000001]
[null,"UAB Skominta","40410/501399",null,null,null,"ŠulinėlisŠulinėlis PL didelis (kapa)","Šulinėlis PL didelis (kapa)",null,null,"+","+",71]
[null,"UAB Skominta","40410/501397",null,null,null,"ŠulinysŠulinio PL dangtis (apvalus)","Šulinio PL dangtis (apvalus)",null,null,"+","+",50]
[null,"UAB Skominta","40410/501403",null,null,null,"ŠulinysŠulinio PL dangtis (kvadratinis)","Šulinio PL dangtis (kvadratinis)",null,null,"+","+",80]
[null,"UAB Skominta","40410/501396",null,null,null,"ŠulinysŠulinio PL žiedas ","Šulinio PL žiedas ",null,null,"+","+",50]
[null,"UAB Skominta","40410/501398",null,null,null,"Kamštinis uždarymo įtaisasUždarymo įtaisas DN50","Uždarymo įtaisas DN50",null,null,"+","+",3.4]
[null,null,null,null,null,null,"Kamštinis uždarymo įtaisasUždarymo įtaisas DN65","Uždarymo įtaisas DN65",null,null,"+","+",5.7]
[null,null,null,null,"UAB Dujotiekio statyba","40410/530099","Kamštinis uždarymo įtaisasUždarymo įtaisas DN80","Uždarymo įtaisas DN80",null,null,"+","+",8.65]
[null,"Rangovas",null,null,null,null,"Kamštinis uždarymo įtaisasUždarymo įtaisas DN80(su flanšu)","Uždarymo įtaisas DN80(su flanšu)",null,null,"+","+",21]
[null,"pasirinkti",null,null,null,null,"Kamštinis uždarymo įtaisasUždarymo įtaisas DN100(su flanšu)","Uždarymo įtaisas DN100(su flanšu)",null,null,"+","+",29]
[null,"UAB Alduva",null,null,null,null,"Kamštinis uždarymo įtaisasUždarymo įtaisas DN150(su flanšu)","Uždarymo įtaisas DN150(su flanšu)",null,null,"+","+",92]
[null,"UAB Asirinta",null,null,null,null,"Rutulinis uždarymo įtaisasUždarymo įtaisas DN50","Uždarymo įtaisas DN50",null,null,"+","+",2.6]
[null,"UAB DS1",null,null,null,null,"Rutulinis uždarymo įtaisasUždarymo įtaisas DN65","Uždarymo įtaisas DN65",null,null,"+","+",4]
[null,"UAB Dujotiekio statyba",null,null,"UAB Sandaila","40410/530101","Rutulinis uždarymo įtaisasUždarymo įtaisas DN80","Uždarymo įtaisas DN80",null,null,"+","+",5.4]
[null,"UAB Dujotiekis",null,null,"UAB Sandaila","40700/522263","Rutulinis uždarymo įtaisasUždarymo įtaisas DN100","Uždarymo įtaisas DN100",null,null,"+","+",8.4]
[null,"UAB Dujus",null,null,null,null,"Rutulinis uždarymo įtaisasUždarymo įtaisas DN125","Uždarymo įtaisas DN125",null,null,"+","+",13]
[null,"UAB Dusta",null,null,null,null,"Rutulinis uždarymo įtaisasUždarymo įtaisas DN150","Uždarymo įtaisas DN150",null,null,"+","+",18]
[null,"UAB Geovizija",null,null,null,null,"Rutulinis uždarymo įtaisasUždarymo įtaisas DN200","Uždarymo įtaisas DN200",null,null,"+","+",38]
[null,"UAB Kalistara",null,null,null,null,"Rutulinis uždarymo įtaisasUždarymo įtaisas DN250","Uždarymo įtaisas DN250",null,null,"+","+",74]
[null,"UAB Labas GAS",null,null,"UAB Labas GAS","40700/530396","Rutulinis uždarymo įtaisasUždarymo įtaisas DN300","Uždarymo įtaisas DN300",null,null,"+","+",110]
{"$rows_left_out":29}
{"sheet":"Rekvizitai","index":3,"n_rows":20,"n_cols":5,"rows_kept":20,"cut":false,"hidden":true,"merged":[]}
[null,"Rangovas","Adresas","Įmonės kodas","PVM kodas"]
["UAB DS1","UAB „DS-1“","Zietelos g. 3, 03160 Vilnius","Įmonės kodas: 181123848","PVM kodas: LT811238412"]
["UAB Labas GAS","UAB „Labas GAS“","Perspektyvos g 18, 52119 Kaunas","Įmonės kodas: 124552684","PVM kodas: LT245526811"]
["UAB Para","UAB \"Para\"","Ūdrijos g. 38, 62175 Alytus","Įmonės kodas: 149602586","PVM kodas: LT496025811"]
["UAB Rimgauda","UAB „Rimgauda“","Dūmų g. 3, 11119 Vilnius","Įmonės kodas: 300639104","PVM kodas: LT100002935115"]
["UAB Skominta","UAB „Skominta“","Naugarduko 97, 03202 Vilnius","Įmonės kodas: 147895076","PVM kodas: LT478950716"]
["UAB Geovizija","UAB „Geovizija“","Taikos pr. 116U, 51152 Kaunas","Įmonės kodas: 300810466","PVM kodas: LT100003215414"]
["UAB Asirinta","UAB „Asirinta\"","Linininkų g. 3, Upytė, Upytės sen., 38294 Panevėžio r. sav.","Įmonės kodas: 168973838","PVM kodas: LT689738314"]
["UAB Sandaila","UAB„Sandaila“","Aušros al. 49, 76302 Šiauliai","Įmonės kodas: 145269860","PVM kodas: LT452698610"]
["UAB Dujotiekio statyba","UAB „Dujotiekio statyba\"","Elektronikos g. 7, 35116 Panevėžys","Įmonės kodas: 147651435","PVM kodas: LT476514314"]
["UAB Transmodo","UAB „TRANSMODO“","Dzūkų g. 11, Kruklių k., 65241 Varėnos r.","Įmonės kodas: 300598248","PVM kodas: LT100002621318"]
["UAB Vytrita","UAB „Vytrita“","Atramos g. 2, 47174 Kaunas","Įmonės kodas: 133858826","PVM kodas: LT338588219"]
["UAB Žilinskis ir Co","UAB „Žilinskis ir Co“","Ateities pl. 31, LT-52167 Kaunas","Įmonės kodas: 304317232","PVM kodas: LT100010333316"]
["UAB Skomintos statyba","UAB „Skomintos statyba\"","Kalvarijų g. 143, 08221 Vilnius ","Įmonės kodas: 305457963","PVM kodas: LT100013016313"]
["UAB Dusta","UAB „Dusta“","Metalo g. 23, 02190 Vilnius","Įmonės kodas: 120282394","PVM kodas: LT202823917"]
["UAB Dujus","UAB \"Dujus\"","Žemaičių g. 32, Ariogala, LT-60255 Raseinių r.","Įmonės kodas: 302566466","PVM kodas: LT100005777719"]
["UAB Kalistara","UAB „Kalistara“","Išradėjų g. 13B, 78149 Šiauliai","Įmonės kodas: 300665864","PVM kodas: LT100004354518 "]
["UAB Vilniaus inžinerija","UAB „Vilniaus inžinerija“","Visorių Sodų 15-oji g. 28, 08451 Vilnius","Įmonės kodas: 303049703","PVM kodas: LT100009659010"]
["UAB Alduva","UAB „Alduva“","Smolensko g. 5A, 03202 Vilnius","Įmonės kodas: 300086828","PVM kodas: LT100001543418"]
["UAB Dujotiekis","UAB \"Dujotiekis\"","V. Landsbergio-Žemkalnio g. 22, 49267 Kaunas","Įmonės kodas: 132121146","PVM kodas: LT321211419"]